{"text_format":"3","workbook":"xlsx","n_sheets":3,"sheets":["Tool","Report","Source"],"not_rendered":{"charts":1},"read":"whole","date_system":"1900"}

{"sheet":"Tool","index":0,"n_rows":101,"n_cols":14,"rows_kept":101,"merged":[[2,2,3,2],[2,4,3,4],[2,6,3,6],[2,8,3,8],[7,2,9,8],[7,12,9,13],[10,2,10,4],[10,6,10,8],[10,12,10,13],[11,2,11,4],[11,6,11,8],[11,12,13,13],[20,2,20,4],[20,6,20,8],[21,2,21,4],[21,6,21,8],[31,2,33,8],[31,12,33,13],[34,2,34,4],[34,6,34,8],[34,12,34,13],[35,2,35,4],[35,6,35,8],[35,12,37,13],[44,2,44,4],[44,6,44,8],[45,2,45,4],[45,6,45,8],[55,2,57,8],[55,12,57,13],[58,2,58,4],[58,6,58,8],[58,12,58,13],[59,2,59,4],[59,6,59,8],[59,12,61,13],[68,2,68,4],[68,6,68,8],[69,2,69,4],[69,6,69,8],[79,2,81,8],[79,12,81,13],[82,2,82,4],[82,6,82,8],[82,12,82,13],[83,2,83,4],[83,6,83,8],[83,12,85,13],[92,2,92,4],[93,2,93,4]]}
[]
[]
[null,null,"Assessed\nuse-case:",null,"Cool PKI 2023",null,"Overall maturity:",null,{"$f":"Report!E8","v":"Basic"}]
[]
[]
[]
[]
[null,null,"1. Governance",{"$nulls":9},"Statistics"]
[]
[]
[null,null,"1.1. Strategy and vision",{"$nulls":3},"1.2. Policies and documentation",{"$nulls":5},"Module maturity:"]
[null,null,"Responsible for the PKI management and strategy. Includes alignment with organizational goals and requirements, risk management, and policy decisions.",{"$nulls":3},"Formal policies and practice statements for supported PKI services and use-cases. Formal management of agreements between parties involved in the PKI.",{"$nulls":5},{"$f":"Report!E56","v":"Advanced"}]
[null,null,6,6,"Not evaluated",null,3,6,"Not evaluated"]
[{"$nulls":3},7,"Not Applicable",null,null,7,"Not Applicable"]
[{"$nulls":3},1,{"$f":"VLOOKUP(_xlfn.CONCAT($C$11,\"-\",D15),Source!$B$4:$D$78,3,0)","v":"There are no leadership responsibilities and vision defined. The design is managed ad-hoc."},null,null,1,{"$f":"VLOOKUP(_xlfn.CONCAT($G$11,\"-\",H15),Source!$B$4:$D$78,3,0)","v":"There are no or limited policies and documentation."},{"$nulls":3},"G1",{"$f":"Report!B62","v":"Not Applicable"}]
[{"$nulls":3},2,{"$f":"VLOOKUP(_xlfn.CONCAT($C$11,\"-\",D16),Source!$B$4:$D$78,3,0)","v":"Basic vision has been developed but not followed. The scope and business drivers are not fully documented and understood."},null,null,2,{"$f":"VLOOKUP(_xlfn.CONCAT($G$11,\"-\",H16),Source!$B$4:$D$78,3,0)","v":"The scope of policies is defined. Documented policies are not in the full scope and are not fully implemented and followed."},{"$nulls":3},"G2",{"$f":"Report!B67","v":"Advanced"}]
[{"$nulls":3},3,{"$f":"VLOOKUP(_xlfn.CONCAT($C$11,\"-\",D17),Source!$B$4:$D$78,3,0)","v":"There is a responsible sponsor of the PKI. Strategy has been defined and approved."},null,null,3,{"$f":"VLOOKUP(_xlfn.CONCAT($G$11,\"-\",H17),Source!$B$4:$D$78,3,0)","v":"Documentation and policies are in the full scope implemented, including CP and CPS."},{"$nulls":3},"G3",{"$f":"Report!B72","v":"Managed"}]
[{"$nulls":3},4,{"$f":"VLOOKUP(_xlfn.CONCAT($C$11,\"-\",D18),Source!$B$4:$D$78,3,0)","v":"Strategy and vision are followed and regularly measured to improve. The scope, business drivers, and design are documented and reviewed regularly."},null,null,4,{"$f":"VLOOKUP(_xlfn.CONCAT($G$11,\"-\",H18),Source!$B$4:$D$78,3,0)","v":"Disclosure of information contains all relevant policies and documentation. CP and CPS are published and available. There is a documentation management in place that covers the policies and documentation."},{"$nulls":3},"G4",{"$f":"Report!B77","v":"Optimized"}]
[{"$nulls":3},5,{"$f":"VLOOKUP(_xlfn.CONCAT($C$11,\"-\",D19),Source!$B$4:$D$78,3,0)","v":"Strategy and vision are fully in line with the organizational strategy and helps business to achieve future development through continuous improvement."},null,null,5,{"$f":"VLOOKUP(_xlfn.CONCAT($G$11,\"-\",H19),Source!$B$4:$D$78,3,0)","v":"Policies are periodically reviewed and updated according to the changes in the PKI and its environment, and organizational strategy and goals. Policies are followed and enforced, communicated and understood."}]
[]
[null,null,"1.3. Compliance",{"$nulls":3},"1.4. Processes and procedures"]
[null,null,"Adherence to standards and applicable regulations and requirements for the PKI and trust services. Standards and regulations may be internal or external, country specific or purpose specific.",{"$nulls":3},"Processes and procedures related to PKI management tasks and operational activities. This includes also the supply chain procedures and processes that includes acceptance or receipt of the HW and SW related to the PKI."]
[null,null,4,6,"Not evaluated",null,5,6,"Not evaluated"]
[{"$nulls":3},7,"Not Applicable",null,null,7,"Not Applicable"]
[{"$nulls":3},1,{"$f":"VLOOKUP(_xlfn.CONCAT($C$21,\"-\",D25),Source!$B$4:$D$78,3,0)","v":"There is no compliance program in place. The organization is not aware of the relevant laws, regulations, and standards, and is exposed to significant risks."},null,null,1,{"$f":"VLOOKUP(_xlfn.CONCAT($G$21,\"-\",H25),Source!$B$4:$D$78,3,0)","v":"Processes and procedures are not formally defined and documented. Ad-hoc reactions to the events."}]
[{"$nulls":3},2,{"$f":"VLOOKUP(_xlfn.CONCAT($C$21,\"-\",D26),Source!$B$4:$D$78,3,0)","v":"The compliance responsibility is established and assigned. The organization is aware of the relevant laws, regulations, and standards that should be followed."},null,null,2,{"$f":"VLOOKUP(_xlfn.CONCAT($G$21,\"-\",H26),Source!$B$4:$D$78,3,0)","v":"Processes and procedures are formally defined and documented, but not in the full scope and fully implemented and followed."}]
[{"$nulls":3},3,{"$f":"VLOOKUP(_xlfn.CONCAT($C$21,\"-\",D27),Source!$B$4:$D$78,3,0)","v":"Compliance policy is defined, implemented, and communicated. Compliance program is established."},null,null,3,{"$f":"VLOOKUP(_xlfn.CONCAT($G$21,\"-\",H27),Source!$B$4:$D$78,3,0)","v":"The scope of the processes and procedures covers entire PKI implementation and policies, and is documented and followed."}]
[{"$nulls":3},4,{"$f":"VLOOKUP(_xlfn.CONCAT($C$21,\"-\",D28),Source!$B$4:$D$78,3,0)","v":"Compliance program and policy is established and maintained by responsible personnel. Procedures are in place and followed to ensure compliance with relevant laws, regulations, and standards."},null,null,4,{"$f":"VLOOKUP(_xlfn.CONCAT($G$21,\"-\",H28),Source!$B$4:$D$78,3,0)","v":"The evidence from the processes and procedures is collected and maintained. Recurring activities are defined and executed by responsible roles."}]
[{"$nulls":3},5,{"$f":"VLOOKUP(_xlfn.CONCAT($C$21,\"-\",D29),Source!$B$4:$D$78,3,0)","v":"Organization is aware of the relevant laws, regulations, and standards and is able to demonstrate compliance over the time. Compliance program is continuously maintained and improved."},null,null,5,{"$f":"VLOOKUP(_xlfn.CONCAT($G$21,\"-\",H29),Source!$B$4:$D$78,3,0)","v":"The processes and procedures, that are aligned with policies and organizational goals, are reviewed and updated on a regular basis. Evidence is properly managed and controlled."}]
[]
{"$rows_left_out":72}
{"sheet":"Report","index":1,"n_rows":153,"n_cols":10,"rows_kept":153,"merged":[[1,1,2,9],[3,2,4,8],[6,1,6,4],[7,4,9,6],[12,1,12,2],[13,1,14,1],[13,2,14,3],[13,4,14,5],[13,6,14,7],[13,8,14,9],[15,1,16,1],[15,2,16,3],[15,4,16,5],[15,6,16,7],[15,8,16,9],[17,1,20,1],[17,2,18,3],[17,4,18,5],[17,6,18,7],[17,8,18,9],[52,1,53,4],[52,8,53,9],[54,4,54,6],[55,4,56,6],[58,1,58,9],[59,1,59,9],[61,1,61,2],[61,3,61,9],[63,1,63,9],[64,1,64,9],[66,1,66,2],[66,3,66,9],[68,1,68,9],[69,1,69,9],[71,1,71,2],[71,3,71,9],[73,1,73,9],[74,1,74,9],[76,1,76,2],[76,3,76,9],[79,1,80,4],[79,8,80,9],[81,4,81,6],[82,4,83,6],[85,1,85,9],[86,1,86,9],[88,1,88,2],[88,3,88,9],[90,1,90,9],[91,1,91,9],[93,1,93,2],[93,3,93,9],[95,1,95,9],[96,1,96,9],[98,1,98,2],[98,3,98,9],[100,1,100,9],[101,1,101,9],[103,1,103,2],[103,3,103,9],[106,1,107,4],[108,4,108,6],[108,7,108,9],[109,4,110,6],[109,8,110,9],[112,1,112,9],[113,1,113,9],[115,1,115,2],[115,3,115,9],[117,1,117,9],[118,1,118,9],[120,1,120,2],[120,3,120,9],[122,1,122,9],[123,1,123,9],[125,1,125,2],[125,3,125,9],[127,1,127,9],[128,1,128,9],[130,1,130,2],[130,3,130,9],[133,1,134,4],[133,8,134,9],[135,4,135,6],[136,4,137,6],[139,1,139,9],[140,1,140,9],[142,1,142,2],[142,3,142,9],[144,1,144,9],[145,1,145,9],[147,1,147,2],[147,3,147,9],[149,1,149,9],[150,1,150,9],[152,1,152,2],[152,3,152,9]]}
[]
[null,"PKI Maturity - Self Assessment results"]
[]
[null,null,{"$f":"Tool!E3","v":"Cool PKI 2023"}]
[]
[]
[null,"Overall reached maturity of use-case:"]
[{"$nulls":4},{"$f":"VLOOKUP(TRUNC(SUM(G61,G66,G71,G76,G88,G93,G98,G103,G115,G120,G125,G130,G142,G147,G152)/(F61+F66+F71+F76+F88+F93+F98+F103+F115+F120+F125+F130+F142+F147+F152),0),Source!$B$81:$C$85,2,0)","v":"Basic"}]
[]
[]
[null,"Number of applicable categories:",{"$nulls":3},{"$f":"_xlfn.CONCAT((15-H61-H66-H71-H76-H88-H93-H98-H103-H115-H120-H125-H130-H142-H147-H152),\" of 15\")","v":"14 of 15"}]
[]
[null,"Module results"]
[null,"Module",{"$f":"B53","v":"1. Governance"},null,{"$f":"B80","v":"2. Management"},null,{"$f":"B107","v":"3. Operations"},null,{"$f":"B134","v":"4. Resources"}]
[]
[null,"Maturity",{"$f":"E56","v":"Advanced"},null,{"$f":"E83","v":"Basic"},null,{"$f":"E110","v":"Initial"},null,{"$f":"E137","v":"Initial"}]
[]
[null,"Applicable categories",{"$f":"_xlfn.CONCAT((4-H61-H66-H71-H76),\" of 4\")","v":"3 of 4"},null,{"$f":"_xlfn.CONCAT((4-H88-H93-H98-H103),\" of 4\")","v":"4 of 4"},null,{"$f":"_xlfn.CONCAT((4-H115-H120-H125-H130),\" of 4\")","v":"4 of 4"},null,{"$f":"_xlfn.CONCAT((3-H142-H147-H152),\" of 3\")","v":"3 of 3"}]
[]
[null,null,"G1","G2","M1","M2","O1","O2","R1","R2"]
[null,null,"G3","G4","M3","M4","O3","O4","R3"]
{"$rows_empty":31}
[null,{"$f":"Tool!C8","v":"1. Governance"}]
[]
[{"$nulls":4},"Reached maturity of module:"]
[{"$nulls":4},{"$f":"IF(SUM(G61,G66,G71,G76)=0,\"\",VLOOKUP(TRUNC(SUM(G61,G66,G71,G76)/(F61+F66+F71+F76),0),Source!$B$81:$C$85,2,0))","v":"Advanced"}]
[]
[]
[null,{"$f":"Tool!C11","v":"1.1. Strategy and vision"}]
[null,{"$f":"Tool!C12","v":"Responsible for the PKI management and strategy. Includes alignment with organizational goals and requirements, risk management, and policy decisions."}]
{"$rows_left_out":94}
{"sheet":"Source","index":2,"n_rows":88,"n_cols":20,"rows_kept":88,"hidden":true}
[]
[{"$nulls":3},"No text inserted"]
[null,"Category","Source","Text"]
[null,{"$f":"_xlfn.CONCAT(Tool!$C$11,\"-\",Tool!D15)","v":"1.1. Strategy and vision-1"},"| **1 - Initial**   | There are no leadership responsibilities and vision defined. The design is managed ad-hoc.                                                              |",{"$f":"IF(C4=\"\",_xlfn.CONCAT(B4,\": \",$D$2),TRIM(_xlfn.TEXTBEFORE(_xlfn.TEXTAFTER(C4,\"|\",2),\"|\")))","v":"There are no leadership responsibilities and vision defined. The design is managed ad-hoc."},null,"Go to","GitHub",{"$nulls":6},"Otázka","Value","Assessment",null,null,"Weight categories"]
[null,{"$f":"_xlfn.CONCAT(Tool!$C$11,\"-\",Tool!D16)","v":"1.1. Strategy and vision-2"},"| **2 - Basic**     | Basic vision has been developed but not followed. The scope and business drivers are not fully documented and understood.                               |","Basic vision has been developed but not followed. The scope and business drivers are not fully documented and understood.",null,"Find required categroy and open the folder",{"$nulls":7},"G1",{"$f":"Tool!C13","v":6},{"$f":"IF(OR(O5=6,O5=7),0,O5)","v":0},null,null,"1.1. Strategy and vision","5"]
[null,{"$f":"_xlfn.CONCAT(Tool!$C$11,\"-\",Tool!D17)","v":"1.1. Strategy and vision-3"},"| **3 - Advanced**  | There is a responsible sponsor of the PKI. Strategy has been defined and approved.                                                                      |","There is a responsible sponsor of the PKI. Strategy has been defined and approved.",null,"Open \"_index.md\" file",{"$nulls":7},"G2",{"$f":"Tool!G13","v":3},3,null,null,"1.2. Policies and documentation","4"]
[null,{"$f":"_xlfn.CONCAT(Tool!$C$11,\"-\",Tool!D18)","v":"1.1. Strategy and vision-4"},"| **4 - Managed**   | Strategy and vision are followed and regularly measured to improve. The scope, business drivers, and design are documented and reviewed regularly.      |","Strategy and vision are followed and regularly measured to improve. The scope, business drivers, and design are documented and reviewed regularly.",null,"Go to \"Code\" tab",{"$nulls":7},"G3",{"$f":"Tool!C23","v":4},4,null,null,"1.3. Compliance","2"]
[null,{"$f":"_xlfn.CONCAT(Tool!$C$11,\"-\",Tool!D19)","v":"1.1. Strategy and vision-5"},"| **5 - Optimized** | Strategy and vision are fully in line with the organizational strategy and helps business to achieve future development through continuous improvement. |","Strategy and vision are fully in line with the organizational strategy and helps business to achieve future development through continuous improvement.",null,"Find \"## Category maturity levels description\" chapter",{"$nulls":7},"G4",{"$f":"Tool!G23","v":5},5,null,null,"1.4. Processes and procedures","3"]
[null,{"$f":"_xlfn.CONCAT(Tool!$G$11,\"-\",Tool!D15)","v":"1.2. Policies and documentation-1"},"| **1 - Initial**   | There are no or limited policies and documentation.                                                                                                                                                             |",{"$f":"IF(C9=\"\",_xlfn.CONCAT(B9,\": \",$D$2),TRIM(_xlfn.TEXTBEFORE(_xlfn.TEXTAFTER(C9,\"|\",2),\"|\")))","v":"There are no or limited policies and documentation."},null,"Mark 5 rows of the table containing the description and copy it",{"$nulls":7},"M1",{"$f":"Tool!C37","v":4},4,null,null,"2.1. Key Management","4"]
[null,{"$f":"_xlfn.CONCAT(Tool!$G$11,\"-\",Tool!D16)","v":"1.2. Policies and documentation-2"},"| **2 - Basic**     | The scope of policies is defined. Documented policies are not in the full scope and are not fully implemented and followed.                                                                                     |",{"$f":"IF(C10=\"\",_xlfn.CONCAT(B10,\": \",$D$2),TRIM(_xlfn.TEXTBEFORE(_xlfn.TEXTAFTER(C10,\"|\",2),\"|\")))","v":"The scope of policies is defined. Documented policies are not in the full scope and are not fully implemented and followed."},{"$nulls":9},"M2",{"$f":"Tool!G37","v":4},4,null,null,"2.2. Certificate Management","4"]
[null,{"$f":"_xlfn.CONCAT(Tool!$G$11,\"-\",Tool!D17)","v":"1.2. Policies and documentation-3"},"| **3 - Advanced**  | Documentation and policies are in the full scope implemented, including CP and CPS.                                                                                                                             |","Documentation and policies are in the full scope implemented, including CP and CPS.",null,"Step in the first cell of category in \"C\" column",{"$nulls":7},"M3",{"$f":"Tool!C47","v":1},1,null,null,"2.3. Infrastructure Management","2"]
[null,{"$f":"_xlfn.CONCAT(Tool!$G$11,\"-\",Tool!D18)","v":"1.2. Policies and documentation-4"},"| **4 - Managed**   | Disclosure of information contains all relevant policies and documentation. CP and CPS are published and available. There is a documentation management in place that covers the policies and documentation.    |  ","Disclosure of information contains all relevant policies and documentation. CP and CPS are published and available. There is a documentation management in place that covers the policies and documentation.",null,"Paste it",{"$nulls":7},"M4",{"$f":"Tool!G47","v":1},1,null,null,"2.4. Change Management and Agility","3"]
[null,{"$f":"_xlfn.CONCAT(Tool!$G$11,\"-\",Tool!D19)","v":"1.2. Policies and documentation-5"},"| **5 - Optimized** | Policies are periodically reviewed and updated according to the changes in the PKI and its environment, and organizational strategy and goals. Policies are followed and enforced, communicated and understood. |","Policies are periodically reviewed and updated according to the changes in the PKI and its environment, and organizational strategy and goals. Policies are followed and enforced, communicated and understood.",{"$nulls":9},"O1",{"$f":"Tool!C61","v":1},1,null,null,"3.1. Resilience","4"]
[null,{"$f":"_xlfn.CONCAT(Tool!$C$21,\"-\",Tool!D15)","v":"1.3. Compliance-1"},"| **1 - Initial**   | There is no compliance program in place. The organization is not aware of the relevant laws, regulations, and standards, and is exposed to significant risks.                                   |","There is no compliance program in place. The organization is not aware of the relevant laws, regulations, and standards, and is exposed to significant risks.",{"$nulls":9},"O2",{"$f":"Tool!G61","v":1},1,null,null,"3.2. Interoperability","2"]
[null,{"$f":"_xlfn.CONCAT(Tool!$C$21,\"-\",Tool!D16)","v":"1.3. Compliance-2"},"| **2 - Basic**     | The compliance responsibility is established and assigned. The organization is aware of the relevant laws, regulations, and standards that should be followed.                                  |","The compliance responsibility is established and assigned. The organization is aware of the relevant laws, regulations, and standards that should be followed.",{"$nulls":9},"O3",{"$f":"Tool!C71","v":1},1,null,null,"3.3. Monitoring and Auditing","2"]
[null,{"$f":"_xlfn.CONCAT(Tool!$C$21,\"-\",Tool!D17)","v":"1.3. Compliance-3"},"| **3 - Advanced**  | Compliance policy is defined, implemented, and communicated. Compliance program is established.                                                                                                 |","Compliance policy is defined, implemented, and communicated. Compliance program is established.",{"$nulls":9},"O4",{"$f":"Tool!G71","v":1},1,null,null,"3.4. Automation","2"]
[null,{"$f":"_xlfn.CONCAT(Tool!$C$21,\"-\",Tool!D18)","v":"1.3. Compliance-4"},"| **4 - Managed**   | Compliance program and policy is established and maintained by responsible personnel. Procedures are in place and followed to ensure compliance with relevant laws, regulations, and standards. |","Compliance program and policy is established and maintained by responsible personnel. Procedures are in place and followed to ensure compliance with relevant laws, regulations, and standards.",{"$nulls":9},"R1",{"$f":"Tool!C85","v":1},1,null,null,"4.1. Sourcing","4"]
[null,{"$f":"_xlfn.CONCAT(Tool!$C$21,\"-\",Tool!D19)","v":"1.3. Compliance-5"},"| **5 - Optimized** | Organization is aware of the relevant laws, regulations, and standards and is able to demonstrate compliance over the time. Compliance program is continuously maintained and improved.         |","Organization is aware of the relevant laws, regulations, and standards and is able to demonstrate compliance over the time. Compliance program is continuously maintained and improved.",{"$nulls":9},"R2",{"$f":"Tool!G85","v":3},3,null,null,"4.2. Knowledge and Training","3"]
[null,{"$f":"_xlfn.CONCAT(Tool!$G$21,\"-\",Tool!D15)","v":"1.4. Processes and procedures-1"},"| **1 - Initial**   | Processes and procedures are not formally defined and documented. Ad-hoc reactions to the events.                                                                                |","Processes and procedures are not formally defined and documented. Ad-hoc reactions to the events.",{"$nulls":9},"R3",{"$f":"Tool!C95","v":1},1,null,null,"4.3. Awareness","3"]
[null,{"$f":"_xlfn.CONCAT(Tool!$G$21,\"-\",Tool!D16)","v":"1.4. Processes and procedures-2"},"| **2 - Basic**     | Processes and procedures are formally defined and documented, but not in the full scope and fully implemented and followed.                                                      |","Processes and procedures are formally defined and documented, but not in the full scope and fully implemented and followed."]
[null,{"$f":"_xlfn.CONCAT(Tool!$G$21,\"-\",Tool!D17)","v":"1.4. Processes and procedures-3"},"| **3 - Advanced**  | The scope of the processes and procedures covers entire PKI implementation and policies, and is documented and followed.                                                         |","The scope of the processes and procedures covers entire PKI implementation and policies, and is documented and followed."]
[null,{"$f":"_xlfn.CONCAT(Tool!$G$21,\"-\",Tool!D18)","v":"1.4. Processes and procedures-4"},"| **4 - Managed**   | The evidence from the processes and procedures is collected and maintained. Recurring activities are defined and executed by responsible roles.                                  |","The evidence from the processes and procedures is collected and maintained. Recurring activities are defined and executed by responsible roles."]
[null,{"$f":"_xlfn.CONCAT(Tool!$G$21,\"-\",Tool!D19)","v":"1.4. Processes and procedures-5"},"| **5 - Optimized** | The processes and procedures, that are aligned with policies and organizational goals, are reviewed and updated on a regular basis. Evidence is properly managed and controlled. |","The processes and procedures, that are aligned with policies and organizational goals, are reviewed and updated on a regular basis. Evidence is properly managed and controlled."]
[null,{"$f":"_xlfn.CONCAT(Tool!$C$35,\"-\",Tool!D15)","v":"2.1. Key Management-1"},"| **1 - Initial**   | No key management is defined. There are no key management responsibilities defined and assigned.                                                                                                                                                                 |","No key management is defined. There are no key management responsibilities defined and assigned."]
[null,{"$f":"_xlfn.CONCAT(Tool!$C$35,\"-\",Tool!D16)","v":"2.1. Key Management-2"},"| **2 - Basic**     | Responsibilities and roles for key management are defined. Key management is managed ad-hoc and there is no documentation and inventory of cryptographic keys maintained.                                                                                        |","Responsibilities and roles for key management are defined. Key management is managed ad-hoc and there is no documentation and inventory of cryptographic keys maintained."]
[null,{"$f":"_xlfn.CONCAT(Tool!$C$35,\"-\",Tool!D17)","v":"2.1. Key Management-3"},"| **3 - Advanced**  | Key management and lifecycle is documented and maintained. Inventory of cryptographic keys and devices is avaialble. Procedures are formally followed.                                                                                                           |","Key management and lifecycle is documented and maintained. Inventory of cryptographic keys and devices is avaialble. Procedures are formally followed."]
[null,{"$f":"_xlfn.CONCAT(Tool!$C$35,\"-\",Tool!D18)","v":"2.1. Key Management-4"},"| **4 - Managed**   | Encryption and key management policies are documented, followed, and integrated in the organization. Inventory of cryptographic keys and devices is maintained and validated. Responsibilities and roles are assigned and aware of all processes and procedures. |","Encryption and key management policies are documented, followed, and integrated in the organization. Inventory of cryptographic keys and devices is maintained and validated. Responsibilities and roles are assigned and aware of all processes and procedures."]
[null,{"$f":"_xlfn.CONCAT(Tool!$C$35,\"-\",Tool!D19)","v":"2.1. Key Management-5"},"| **5 - Optimized** | Key management is periodically reviewed and updated. Inventory of cryptographic keys and devices is complete, maintained and frequently validated. Process and procedures are formally approved, integrated and followed in the organization.                    |","Key management is periodically reviewed and updated. Inventory of cryptographic keys and devices is complete, maintained and frequently validated. Process and procedures are formally approved, integrated and followed in the organization."]
[null,{"$f":"_xlfn.CONCAT(Tool!$G$35,\"-\",Tool!D15)","v":"2.2. Certificate Management-1"},"| **1 - Initial**   | Certificates are ad-hoc managed, without proper control and always reactive. Inventory is not available.                                                                                                                                                                                                                                                              |","Certificates are ad-hoc managed, without proper control and always reactive. Inventory is not available."]
[null,{"$f":"_xlfn.CONCAT(Tool!$G$35,\"-\",Tool!D16)","v":"2.2. Certificate Management-2"},"| **2 - Basic**     | Certificates are managed, but not according to industry standards and regulations. Inventory of certificates is not maintained.                                                                                                                                                                                                                                       |","Certificates are managed, but not according to industry standards and regulations. Inventory of certificates is not maintained."]
{"$rows_left_out":58}